75 lines from the end of output. Whole 2214 lines are too large to paste here, system rejected it.)

Format
Log
Post date
2017-07-04 22:17
Période de publication
Illimité
  1. make[1]: Entering directory '/factory/ja-po/bluefish/bluefish/bluefish-2.2.10~svn8736.deb.nIh407/macosx'
  2. make[1]: Leaving directory '/factory/ja-po/bluefish/bluefish/bluefish-2.2.10~svn8736.deb.nIh407/macosx'
  3. test -n "" \
  4. || find "bluefish-2.2.10~svn8736" -type d ! -perm -755 \
  5. -exec chmod u+rwx,go+rx {} \; -o \
  6. ! -type d ! -perm -444 -links 1 -exec chmod a+r {} \; -o \
  7. ! -type d ! -perm -400 -exec chmod a+r {} \; -o \
  8. ! -type d ! -perm -444 -exec /bin/sh /factory/ja-po/bluefish/bluefish/install-sh -c -m a+r {} {} \; \
  9. || chmod -R a+r "bluefish-2.2.10~svn8736"
  10. tardir=bluefish-2.2.10~svn8736 && ${TAR-tar} chof - "$tardir" | GZIP=--best gzip -c >bluefish-2.2.10~svn8736.tar.gz
  11. if test -d "bluefish-2.2.10~svn8736"; then find "bluefish-2.2.10~svn8736" -type d ! -perm -200 -exec chmod u+w {} ';' && rm -rf "bluefish-2.2.10~svn8736" || { sleep 5 && rm -rf "bluefish-2.2.10~svn8736"; }; else :; fi
  12. + cd ..
  13. ++ mktemp -d -p . bluefish-2.2.10~svn8736.deb.XXXXXX
  14. + TEMPDIR=./bluefish-2.2.10~svn8736.deb.wQZiX4
  15. + cd ./bluefish-2.2.10~svn8736.deb.wQZiX4
  16. + mv .././bluefish-2.2.10~svn8736.deb.nIh407/bluefish-2.2.10~svn8736.tar.gz .
  17. + ln -sf bluefish-2.2.10~svn8736.tar.gz bluefish_2.2.10~svn8736.orig.tar.gz
  18. + tar xzf bluefish_2.2.10~svn8736.orig.tar.gz
  19. + cd bluefish-2.2.10~svn8736
  20. + svn export https://bluefish.svn.sourceforge.net/svnroot/bluefish//packages/debian/bluefish/trunk/debian
  21. Redirecting to URL 'https://svn.code.sf.net/p/bluefish/code/packages/debian/bluefish/trunk/debian':
  22. A debian
  23. A debian/patches
  24. A debian/upstream
  25. A debian/source
  26. A debian/changelog
  27. A debian/rules
  28. A debian/control
  29. A debian/NEWS
  30. A debian/bluefish-plugins.install
  31. A debian/compat
  32. A debian/copyright
  33. A debian/patches/827747_fix_z-index_description.patch
  34. A debian/patches/series
  35. A debian/patches/759935_autogen.patch
  36. A debian/patches/LP810663_blacklist_from_appmenu.patch
  37. A debian/upstream/signing-key.asc
  38. A debian/bluefish.install
  39. A debian/source/include-binaries
  40. A debian/source/format
  41. A debian/watch
  42. A debian/bluefish-data.install
  43. A debian/bluefish.xpm
  44. A debian/bluefish.docs
  45. Exported revision 8738.
  46. + dch -v 2.2.10~svn8736-0bf1 -D experimental 'Automatically created Debian package by make-deb.sh : 8738 $.'
  47. + debuild -us -uc -b
  48. dpkg-buildpackage -rfakeroot -us -uc -b
  49. dpkg-buildpackage: info: source package bluefish
  50. dpkg-buildpackage: info: source version 2.2.10~svn8736-0bf1
  51. dpkg-buildpackage: info: source distribution experimental
  52. dpkg-buildpackage: info: source changed by Takeshi Hamasaki <hmatrjp@users.sourceforge.jp>
  53. dpkg-source --before-build bluefish-2.2.10~svn8736
  54. dpkg-buildpackage: info: host architecture amd64
  55. fakeroot debian/rules clean
  56. dh clean --with autoreconf,python2 --parallel
  57. dh_testdir -O--parallel
  58. dh_auto_clean -O--parallel
  59. dh_autoreconf_clean -O--parallel
  60. dh_clean -O--parallel
  61. debian/rules build
  62. dh build --with autoreconf,python2 --parallel
  63. dh_testdir -O--parallel
  64. dh_update_autotools_config -O--parallel
  65. debian/rules override_dh_autoreconf
  66. make[1]: Entering directory '/factory/ja-po/bluefish/bluefish/bluefish-2.2.10~svn8736.deb.wQZiX4/bluefish-2.2.10~svn8736'
  67. /bin/bash /factory/ja-po/bluefish/bluefish/bluefish-2.2.10~svn8736.deb.wQZiX4/bluefish-2.2.10~svn8736/autogen.sh -c
  68. /bin/bash: /factory/ja-po/bluefish/bluefish/bluefish-2.2.10~svn8736.deb.wQZiX4/bluefish-2.2.10~svn8736/autogen.sh: No such file or directory
  69. debian/rules:20: recipe for target 'override_dh_autoreconf' failed
  70. make[1]: *** [override_dh_autoreconf] Error 127
  71. make[1]: Leaving directory '/factory/ja-po/bluefish/bluefish/bluefish-2.2.10~svn8736.deb.wQZiX4/bluefish-2.2.10~svn8736'
  72. debian/rules:17: recipe for target 'build' failed
  73. make: *** [build] Error 2
  74. dpkg-buildpackage: error: debian/rules build gave error exit status 2
  75. debuild: fatal error at line 1116:
  76. dpkg-buildpackage -rfakeroot -us -uc -b failed
Télécharger Printable view

URL of this paste

Embed with JavaScript

Embed with iframe

Raw text